{"text_format":"1","workbook":"xlsx","n_sheets":3,"sheets":["Sheet1","Sheet2","Sheet3"],"not_rendered":{"charts":0,"images":0,"macros":0,"external_links":0,"defined_names":0,"comments":0,"pivot_tables":0},"unopened":[],"bounds":{"document_bytes":16777216,"sheet_cells":100000,"rows_first":2000,"rows_last":500,"rows_between":2000,"halvings":0,"cell_chars":16384,"cell_head_chars":4096},"cells_cut":0,"cells_raw":0,"read":"whole","date_system":"1900"}

{"sheet":"Sheet1","index":0,"n_rows":160,"n_cols":23,"rows_kept":160,"cut":false,"hidden":false,"merged":[]}
[null,"Exer. 8 - Simulação  Automático"]
[null,null,null,null,"Min","Max"]
[null,null,"Tempo Vida",null,2,5]
[null,null,"Nº Acidentes/mês ",null,{"$f":"1/12","v":8.3333333333333329E-2},null,"Período Revisão (meses)",null,null,null,3]
[null,null,"Custo Peça",null,100,null,"Intervalo mínimo Subst. Peça",null,null,null,1.5]
[null,null,"Custo/Inspecção/Ver",null,1000,null,"Nº de Runs",null,null,null,150]
[null,null,"Custo/paragem",null,2000,null,null,null,null,null,null,null,null,null,null,null,null,null,null,null,"Custos Mensais"]
[null,null,null,null,null,null,null,null,null,null,null,null,null,null,null,null,null,null,null,"Peças","Revisões","Paragens","Totais"]
[null,"Tempo","Tipo","Subst. ","Prox. Inter. acidentes",null,"Prox","Bom Func. Peça",null,"Prox.","Próx.","Próximo","Tipo","Nº","Nº ","Nº ","Nº ",null,"D.Pad.",{"$f":"STDEV(T11:T160)","v":4.3912532190909781},{"$f":"STDEV(U11:U160)","v":12.766401918213429},{"$f":"STDEV(V11:V160)","v":157.01339220710065},{"$f":"STDEV(W11:W160)","v":155.98323946229166}]
[null,null,"Acontec.","Peça?","NPA","Meses","Acidente","NPA","Meses","Avaria","Revisão","Acontec.","Acontec.","Peças","Revis.","Ava.","Ac.",null,"Média",{"$f":"AVERAGE(T11:T160)","v":42.853679444606819},{"$f":"AVERAGE(U11:U160)","v":324.91111085071844},{"$f":"AVERAGE(V11:V160)","v":474.67017337916565},{"$f":"AVERAGE(W11:W160)","v":842.43496367449075}]
[null,0,"Acidente","Sim",{"$f":"IF(C11=\"Acidente\", RAND(),\"\")","v":0.13560701873412873},{"$f":"IF(E11=\"\",\"\",-1/$E$4*LN(E11))","v":23.975929730870444},{"$f":"+F11","v":23.975929730870444},{"$f":"RAND()","v":5.8627985056038723E-2},{"$f":"IF(H11=\"\",0,$E$3+H11*($F$3-$E$3))","v":2.1758839551681159},{"$f":"+I11","v":2.1758839551681159},{"$f":"+$K$4","v":3},{"$f":"MIN(G11,J11,K11)","v":2.1758839551681159},{"$f":"IF(G11<K11,\"Acidente\",IF(I11<K11,\"Avaria\",\"Revisão\"))","v":"Avaria"},{"$f":"IF(D11=\"Sim\",1,0)","v":1},{"$f":"IF(C11=\"Revisão\",1,0)","v":0},{"$f":"IF(C11=\"Avaria\",1,0)","v":0},{"$f":"IF(C11=\"Acidente\",1,0)","v":1},null,null,{"$f":"+F28","v":37.705567133541216},{"$f":"+F29","v":308.50009472897358},{"$f":"+F30","v":479.88903624506997},{"$f":"+F31","v":826.0946981075848}]
[null,{"$f":"+L11","v":2.1758839551681159},"Avaria",{"$f":"IF(C12=\"Acidente\",\"Sim\",IF(C12=\"Avaria\",\"Sim\",IF(C12=\"Revisão\",IF((B12-B11)>$K$5,\"Sim\",\"Não\"))))","v":"Sim"},"","",{"$f":"IF(F12=\"\",G11,+G11+F12)","v":23.975929730870444},{"$f":"IF(D12=\"Sim\",RAND(),IF(J11>L11,\"\",RAND()))","v":0.63067513220971083},{"$f":"IF(H12=\"\",0,$E$3+H12*($F$3-$E$3))","v":3.8920253966291325},{"$f":"IF(D12=\"Sim\",B12+I12,IF(J11>K11,J11,B12+I12))","v":6.0679093517972484},{"$f":"IF(B12<K11,K11,K11+$K$4)","v":3},3,{"$f":"IF(G12<=L12,\"Acidente\",IF(J12<K12,\"Avaria\",\"Revisão\"))","v":"Revisão"},{"$f":"IF(D12=\"Sim\",1,0)","v":1},{"$f":"IF(C12=\"Revisão\",1,0)","v":0},{"$f":"IF(C12=\"Avaria\",1,0)","v":1},{"$f":"IF(C12=\"Acidente\",1,0)","v":0},null,1,45.833333333333336,333.33333333333331,666.66666666666663,1045.8333333333333]
[null,3,"Revisão",{"$f":"IF(C13=\"Acidente\",\"Sim\",IF(C13=\"Avaria\",\"Sim\",IF(C13=\"Revisão\",IF((B13-B12)>$K$5,\"Sim\",\"Não\"))))","v":"Não"},"","",23.975929730870444,{"$f":"IF(D13=\"Sim\",RAND(),IF(J12>L12,\"\",RAND()))","v":""},{"$f":"IF(H13=\"\",0,$E$3+H13*($F$3-$E$3))","v":0},{"$f":"IF(D13=\"Sim\",B13+I13,IF(J12>K12,J12,B13+I13))","v":6.0679093517972484},{"$f":"IF(B13<K12,K12,K12+$K$4)","v":6},6,"Revisão",0,1,0,0,null,{"$f":"+S12+1","v":2},43.333333333333336,333.33333333333331,400,776.66666666666663]
[null,6,"Revisão","Sim","","",23.975929730870444,0.19485036379582887,2.5845510913874867,8.5845510913874872,9,8.5845510913874872,"Avaria",1,1,0,0,null,{"$f":"+S13+1","v":3},46.666666666666664,333.33333333333331,400,780]
[null,8.5845510913874872,"Avaria","Sim","","",23.975929730870444,0.14258057473611496,2.427741724208345,11.012292815595831,9,9,"Revisão",1,0,1,0,null,4,42.424242424242422,333.33333333333331,303.030303030303,678.78787878787875]
[null,9,"Revisão","Não","","",23.975929730870444,"",0,11.012292815595831,12,11.012292815595831,"Avaria",0,1,0,0,null,5,42.424242424242422,333.33333333333331,303.030303030303,678.78787878787875]
[null,11.012292815595831,"Avaria","Sim","","",23.975929730870444,0.84014383221113187,4.5204314966333961,15.532724312229227,12,12,"Revisão",1,0,1,0,null,6,36.666666666666664,333.33333333333331,400,770]
[null,12,"Revisão","Não","","",23.975929730870444,"",0,15.532724312229227,15,15,{"$f":"IF(G18<(L18+0.09),\"Acidente\",IF(J18<K18,\"Avaria\",\"Revisão\"))","v":"Revisão"},0,1,0,0,null,7,43.38653864448694,300.36834446183269,467.23964694062857,810.99453004694817]
[null,{"$f":"+L18","v":15},{"$f":"+M18","v":"Revisão"},"Sim",{"$f":"IF(C19=\"Acidente\", RAND(),\"\")","v":""},{"$f":"IF(E19=\"\",\"\",-1/$E$4*LN(E19))","v":""},{"$f":"IF(F19=\"\",G18,+G18+F19)","v":23.975929730870444},{"$f":"IF(D19=\"Sim\",RAND(),IF(J18>L18,\"\",RAND()))","v":0.83833435309401239},4.5150030592820372,{"$f":"IF(D19=\"Sim\",B19+I19,IF(J18>K18,J18,B19+I19))","v":19.515003059282037},18,{"$f":"MIN(G19,J19,K19)","v":18},{"$f":"IF(G19<(L19+0.09),\"Acidente\",IF(J19<K19,\"Avaria\",\"Revisão\"))","v":"Revisão"},{"$f":"IF(D19=\"Sim\",1,0)","v":1},{"$f":"IF(C19=\"Revisão\",1,0)","v":1},{"$f":"IF(C19=\"Avaria\",1,0)","v":0},{"$f":"IF(C19=\"Acidente\",1,0)","v":0},null,8,38.46153846153846,333.33333333333331,153.84615384615384,525.64102564102564]
[null,18,"Revisão","Sim","","",23.975929730870444,0.28276859218361616,2.8483057765508484,20.848305776550848,21,20.848305776550848,"Avaria",1,1,0,0,null,9,45.833333333333336,333.33333333333331,666.66666666666663,1045.8333333333333]
[null,20.848305776550848,"Avaria","Sim","","",23.975929730870444,0.39940386152724516,3.1982115845817356,24.046517361132583,21,21,"Revisão",1,0,1,0,null,10,41.666666666666664,333.33333333333331,666.66666666666663,1041.6666666666667]
[null,21,"Revisão","Não","","",23.975929730870444,"",0,24.046517361132583,24,23.975929730870444,"Acidente",0,1,0,0,null,11,43.977529746986548,329.83147310239912,513.07118038150975,886.88018323089545]
[null,23.975929730870444,"Acidente","Sim",0.64848044902279145,5.1974810841465366,29.173410815016979,0.89574560774013712,4.6872368232204114,28.663166554090857,24,24,"Revisão",1,0,0,1,null,12,39.393939393939391,333.33333333333331,303.030303030303,675.75757575757575]
[null,24,"Revisão","Não","","",29.173410815016979,"",0,28.663166554090857,27,27,"Revisão",0,1,0,0,null,13,40.763096028797932,305.7232202159845,475.56945366930921,822.05576991409157]
[null,27,"Revisão","Sim","","",29.173410815016979,0.68387178121862868,4.0516153436558859,31.051615343655886,30,29.173410815016979,"Acidente",1,1,0,0,null,14,39.393939393939391,333.33333333333331,303.030303030303,675.75757575757575]
[null,29.173410815016979,"Acidente","Sim",{"$f":"IF(C26=\"Acidente\", RAND(),\"\")","v":0.9256640181489505},0.92692729857371969,30.100338113590698,0.71897939431569613,4.1569381829470888,33.330348997964066,30,30,{"$f":"IF(G26<(L26+0.09),\"Acidente\",IF(J26<K26,\"Avaria\",\"Revisão\"))","v":"Revisão"},1,0,0,1,null,15,46.666666666666664,333.33333333333331,400,780]
[null,null,null,null,"Total","Mês",null,null,null,null,null,null,null,{"$f":"SUM(N11:N26)","v":11},{"$f":"SUM(O11:O26)","v":9},{"$f":"SUM(P11:P26)","v":4},{"$f":"SUM(Q11:Q26)","v":3},null,16,40.74074074074074,333.33333333333331,518.51851851851848,892.59259259259261]
[null,"Custo das peças",null,null,{"$f":"N27*E5","v":1100},{"$f":"+E28/$B$26","v":37.705567133541216},null,"     Intervalo de Confiança a ",null,null,0.95,null,null,null,null,null,null,null,17,40.74074074074074,333.33333333333331,518.51851851851848,892.59259259259261]
[null,"Custo das revisões",null,null,{"$f":"+O27*E6","v":9000},{"$f":"+E29/$B$26","v":308.50009472897358},null,null,"Custos Mensais Totais",null,null,null,null,null,null,null,null,null,18,40.861741107591236,314.32108544300951,377.1853025316114,732.36812908221214]
[null,"Custos De paragens",null,null,{"$f":"+E7*(P27+Q27)","v":14000},{"$f":"+E30/$B$26","v":479.88903624506997},null,null,null,null,null,null,null,null,null,null,null,null,19,44.444444444444443,333.33333333333331,518.51851851851848,896.2962962962963]
[null,"Custo Total",null,null,{"$f":"+E28+E29+E30","v":24100},{"$f":"+E31/$B$26","v":826.0946981075848},null,"Limite Inferior",null,null,"Limite Superior",null,null,null,null,null,null,null,20,50,333.33333333333331,666.66666666666663,1050]
[null,null,null,null,null,null,null,{"$f":"+$W$10-$W$9/SQRT($S$160+1)*TINV(1-$K$28,$S$160)","v":817.2685029792176},null,null,{"$f":"+$W$10+$W$9/SQRT($S$160+1)*TINV(1-$K$28,$S$160)","v":867.60142436976389},null,null,null,null,null,null,null,21,43.333333333333336,333.33333333333331,400,776.66666666666663]
[null,null,null,null,null,null,null,null,null,null,null,null,null,null,null,null,null,null,22,36.363636363636367,333.33333333333331,303.030303030303,672.72727272727275]
[null,null,null,null,null,null,null,null,null,null,null,null,null,null,null,null,null,null,23,39.393939393939391,333.33333333333331,303.030303030303,675.75757575757575]
[null,null,null,null,null,null,null,null,null,null,null,null,null,null,null,null,null,null,24,39.393939393939391,333.33333333333331,303.030303030303,675.75757575757575]
[null,null,null,null,null,null,null,null,null,null,null,null,null,null,null,null,null,null,25,35.897435897435898,333.33333333333331,153.84615384615384,523.07692307692309]
[null,null,null,null,null,null,null,null,null,null,null,null,null,null,null,null,null,null,26,44.444444444444443,333.33333333333331,518.51851851851848,896.2962962962963]
[null,null,null,null,null,null,null,null,null,null,null,null,null,null,null,null,null,null,27,40,333.33333333333331,400,773.33333333333337]
[null,null,null,null,null,null,null,null,null,null,null,null,null,null,null,null,null,null,28,45.833333333333336,333.33333333333331,666.66666666666663,1045.8333333333333]
[null,null,null,null,null,null,null,null,null,null,null,null,null,null,null,null,null,null,29,44.901705238002485,299.34470158668324,598.68940317336649,942.93580999805215]
[null,null,null,null,null,null,null,null,null,null,null,null,null,null,null,null,null,null,30,45.833333333333336,333.33333333333331,666.66666666666663,1045.8333333333333]
[null,null,null,null,null,null,null,null,null,null,null,null,null,null,null,null,null,null,31,36.363636363636367,333.33333333333331,303.030303030303,672.72727272727275]
[null,null,null,null,null,null,null,null,null,null,null,null,null,null,null,null,null,null,32,44.470096673740258,296.46731115826839,592.93462231653677,933.87203014854549]
[null,null,null,null,null,null,null,null,null,null,null,null,null,null,null,null,null,null,33,40.712910613057993,305.34682959793497,474.98395715234329,821.04369736333626]
[null,null,null,null,null,null,null,null,null,null,null,null,null,null,null,null,null,null,34,41.666666666666664,333.33333333333331,222.22222222222223,597.22222222222217]
[null,null,null,null,null,null,null,null,null,null,null,null,null,null,null,null,null,null,35,44.444444444444443,333.33333333333331,518.51851851851848,896.2962962962963]
[null,null,null,null,null,null,null,null,null,null,null,null,null,null,null,null,null,null,36,45.454545454545453,333.33333333333331,303.030303030303,681.81818181818187]
[null,null,null,null,null,null,null,null,null,null,null,null,null,null,null,null,null,null,37,48.273741249774936,321.82494166516619,643.64988333033239,1013.7485662452737]
[null,null,null,null,null,null,null,null,null,null,null,null,null,null,null,null,null,null,38,36.111111111111114,333.33333333333331,222.22222222222223,591.66666666666663]
[null,null,null,null,null,null,null,null,null,null,null,null,null,null,null,null,null,null,39,40.74074074074074,333.33333333333331,518.51851851851848,892.59259259259261]
[null,null,null,null,null,null,null,null,null,null,null,null,null,null,null,null,null,null,40,50,333.33333333333331,666.66666666666663,1050]
[null,null,null,null,null,null,null,null,null,null,null,null,null,null,null,null,null,null,41,36.363636363636367,333.33333333333331,303.030303030303,672.72727272727275]
[null,null,null,null,null,null,null,null,null,null,null,null,null,null,null,null,null,null,42,46.666666666666664,333.33333333333331,400,780]
[null,null,null,null,null,null,null,null,null,null,null,null,null,null,null,null,null,null,43,47.329710082193643,301.1890641594141,774.4861649813505,1123.0049392229582]
[null,null,null,null,null,null,null,null,null,null,null,null,null,null,null,null,null,null,44,36.363636363636367,333.33333333333331,303.030303030303,672.72727272727275]
[null,null,null,null,null,null,null,null,null,null,null,null,null,null,null,null,null,null,45,44.444444444444443,333.33333333333331,518.51851851851848,896.2962962962963]
[null,null,null,null,null,null,null,null,null,null,null,null,null,null,null,null,null,null,46,39.393939393939391,303.030303030303,363.63636363636363,706.06060606060601]
[null,null,null,null,null,null,null,null,null,null,null,null,null,null,null,null,null,null,47,47.97932339024581,305.32296702883696,785.116200931295,1138.4184913503777]
[null,null,null,null,null,null,null,null,null,null,null,null,null,null,null,null,null,null,48,47.666740586416076,306.42904662696048,476.6674058641608,830.76319307753738]
[null,null,null,null,null,null,null,null,null,null,null,null,null,null,null,null,null,null,49,42.424242424242422,333.33333333333331,303.030303030303,678.78787878787875]
[null,null,null,null,null,null,null,null,null,null,null,null,null,null,null,null,null,null,50,38.90253031114414,311.22024248915312,622.44048497830624,972.56325777860343]
[null,null,null,null,null,null,null,null,null,null,null,null,null,null,null,null,null,null,51,43.335954995747912,315.1705817872575,630.34116357451501,988.84770035752047]
[null,null,null,null,null,null,null,null,null,null,null,null,null,null,null,null,null,null,52,46.302986540812164,308.68657693874775,617.3731538774955,972.36271735705543]
[null,null,null,null,null,null,null,null,null,null,null,null,null,null,null,null,null,null,53,36.666666666666664,333.33333333333331,400,770]
[null,null,null,null,null,null,null,null,null,null,null,null,null,null,null,null,null,null,54,40,333.33333333333331,400,773.33333333333337]
[null,null,null,null,null,null,null,null,null,null,null,null,null,null,null,null,null,null,55,36.111111111111114,333.33333333333331,222.22222222222223,591.66666666666663]
[null,null,null,null,null,null,null,null,null,null,null,null,null,null,null,null,null,null,56,42.85645724493348,321.4234293370011,499.99200119089062,864.27188777282515]
[null,null,null,null,null,null,null,null,null,null,null,null,null,null,null,null,null,null,57,42.443965309123762,308.68338406635462,617.36676813270924,968.49411750818763]
[null,null,null,null,null,null,null,null,null,null,null,null,null,null,null,null,null,null,58,39.393939393939391,333.33333333333331,303.030303030303,675.75757575757575]
[null,null,null,null,null,null,null,null,null,null,null,null,null,null,null,null,null,null,59,36.666666666666664,333.33333333333331,400,770]
[null,null,null,null,null,null,null,null,null,null,null,null,null,null,null,null,null,null,60,42.021479726528526,315.16109794896391,490.25059680949948,847.43317448499192]
[null,null,null,null,null,null,null,null,null,null,null,null,null,null,null,null,null,null,61,38.324122209580288,313.56099989656605,487.76155539465827,839.64667750080457]
[null,null,null,null,null,null,null,null,null,null,null,null,null,null,null,null,null,null,62,46.18858027481145,293.92732902152738,755.81313176964193,1095.9290410659808]
[null,null,null,null,null,null,null,null,null,null,null,null,null,null,null,null,null,null,63,44.215590688141035,321.56793227738933,643.13586455477866,1008.9193875203091]
[null,null,null,null,null,null,null,null,null,null,null,null,null,null,null,null,null,null,64,42.424242424242422,333.33333333333331,303.030303030303,678.78787878787875]
[null,null,null,null,null,null,null,null,null,null,null,null,null,null,null,null,null,null,65,41.418537053522144,310.63902790141606,483.21626562442498,835.27383057936322]
[null,null,null,null,null,null,null,null,null,null,null,null,null,null,null,null,null,null,66,43.778992880028476,321.0459477868755,291.85995253352314,656.68489320042715]
[null,null,null,null,null,null,null,null,null,null,null,null,null,null,null,null,null,null,{"$f":"+S77+1","v":67},45.833333333333336,333.33333333333331,666.66666666666663,1045.8333333333333]
[null,null,null,null,null,null,null,null,null,null,null,null,null,null,null,null,null,null,68,50,333.33333333333331,666.66666666666663,1050]
[null,null,null,null,null,null,null,null,null,null,null,null,null,null,null,null,null,null,69,37.705451211876827,301.64360969501462,603.28721939002924,942.63628029692063]
[null,null,null,null,null,null,null,null,null,null,null,null,null,null,null,null,null,null,70,42.218093614781331,307.0406808347733,614.0813616695466,963.3401361191012]
[null,null,null,null,null,null,null,null,null,null,null,null,null,null,null,null,null,null,71,43.333333333333336,333.33333333333331,400,776.66666666666663]
[null,null,null,null,null,null,null,null,null,null,null,null,null,null,null,null,null,null,72,45.833333333333336,333.33333333333331,666.66666666666663,1045.8333333333333]
[null,null,null,null,null,null,null,null,null,null,null,null,null,null,null,null,null,null,73,40,333.33333333333331,400,773.33333333333337]
[null,null,null,null,null,null,null,null,null,null,null,null,null,null,null,null,null,null,74,48.484848484848484,333.33333333333331,303.030303030303,684.84848484848487]
[null,null,null,null,null,null,null,null,null,null,null,null,null,null,null,null,null,null,75,48.148148148148145,333.33333333333331,518.51851851851848,900]
[null,null,null,null,null,null,null,null,null,null,null,null,null,null,null,null,null,null,76,45.454545454545453,333.33333333333331,303.030303030303,681.81818181818187]
[null,null,null,null,null,null,null,null,null,null,null,null,null,null,null,null,null,null,77,36.111111111111114,333.33333333333331,222.22222222222223,591.66666666666663]
[null,null,null,null,null,null,null,null,null,null,null,null,null,null,null,null,null,null,78,48.148148148148145,333.33333333333331,518.51851851851848,900]
[null,null,null,null,null,null,null,null,null,null,null,null,null,null,null,null,null,null,79,40.74074074074074,333.33333333333331,518.51851851851848,892.59259259259261]
[null,null,null,null,null,null,null,null,null,null,null,null,null,null,null,null,null,null,80,41.835225537470762,304.25618572706009,608.51237145412017,954.60378271865102]
[null,null,null,null,null,null,null,null,null,null,null,null,null,null,null,null,null,null,81,43.333333333333336,333.33333333333331,400,776.66666666666663]
[null,null,null,null,null,null,null,null,null,null,null,null,null,null,null,null,null,null,82,44.444444444444443,333.33333333333331,518.51851851851848,896.2962962962963]
[null,null,null,null,null,null,null,null,null,null,null,null,null,null,null,null,null,null,83,38.888888888888886,333.33333333333331,222.22222222222223,594.44444444444446]
[null,null,null,null,null,null,null,null,null,null,null,null,null,null,null,null,null,null,84,38.888888888888886,333.33333333333331,222.22222222222223,594.44444444444446]
[null,null,null,null,null,null,null,null,null,null,null,null,null,null,null,null,null,null,85,50,333.33333333333331,400,783.33333333333337]
[null,null,null,null,null,null,null,null,null,null,null,null,null,null,null,null,null,null,86,47.61904761904762,333.33333333333331,857.14285714285711,1238.0952380952381]
[null,null,null,null,null,null,null,null,null,null,null,null,null,null,null,null,null,null,87,41.901826540922606,322.32174262248162,386.78609114697792,751.00966031038217]
[null,null,null,null,null,null,null,null,null,null,null,null,null,null,null,null,null,null,88,36.450453596853514,308.42691505029893,280.38810459118088,625.26547323833336]
[null,null,null,null,null,null,null,null,null,null,null,null,null,null,null,null,null,null,89,41.466689378574344,318.97453368134114,382.76944041760936,743.2106634775248]
[null,null,null,null,null,null,null,null,null,null,null,null,null,null,null,null,null,null,90,45.833333333333336,333.33333333333331,666.66666666666663,1045.8333333333333]
[null,null,null,null,null,null,null,null,null,null,null,null,null,null,null,null,null,null,91,46.666666666666664,333.33333333333331,400,780]
[null,null,null,null,null,null,null,null,null,null,null,null,null,null,null,null,null,null,92,36.111111111111114,333.33333333333331,222.22222222222223,591.66666666666663]
[null,null,null,null,null,null,null,null,null,null,null,null,null,null,null,null,null,null,93,48.148148148148145,333.33333333333331,518.51851851851848,900]
[null,null,null,null,null,null,null,null,null,null,null,null,null,null,null,null,null,null,94,46.666666666666664,333.33333333333331,400,780]
[null,null,null,null,null,null,null,null,null,null,null,null,null,null,null,null,null,null,95,44.26343920183335,306.43919447423087,476.68319140435915,827.38582508042339]
[null,null,null,null,null,null,null,null,null,null,null,null,null,null,null,null,null,null,96,45.067227527948823,300.44818351965881,600.89636703931762,946.41177808692521]
[null,null,null,null,null,null,null,null,null,null,null,null,null,null,null,null,null,null,97,46.351406064224243,294.96349313597244,758.47755377821488,1099.7924529784116]
[null,null,null,null,null,null,null,null,null,null,null,null,null,null,null,null,null,null,98,43.775466251381509,318.36702728277464,636.73405456554929,998.87654809970536]
[null,null,null,null,null,null,null,null,null,null,null,null,null,null,null,null,null,null,99,39.393939393939391,303.030303030303,363.63636363636363,706.06060606060601]
[null,null,null,null,null,null,null,null,null,null,null,null,null,null,null,null,null,null,100,39.942847103914637,319.5427768313171,639.0855536626342,998.57117759786593]
[null,null,null,null,null,null,null,null,null,null,null,null,null,null,null,null,null,null,101,41.829408052566265,306.74899238548596,278.86272035044175,627.441120788494]
[null,null,null,null,null,null,null,null,null,null,null,null,null,null,null,null,null,null,102,40.74074074074074,333.33333333333331,518.51851851851848,892.59259259259261]
[null,null,null,null,null,null,null,null,null,null,null,null,null,null,null,null,null,null,103,47.748591915141695,330.56717479713478,514.21560523998744,892.53137195226395]
[null,null,null,null,null,null,null,null,null,null,null,null,null,null,null,null,null,null,104,54.166666666666664,333.33333333333331,666.66666666666663,1054.1666666666667]
[null,null,null,null,null,null,null,null,null,null,null,null,null,null,null,null,null,null,105,40.74074074074074,333.33333333333331,518.51851851851848,892.59259259259261]
[null,null,null,null,null,null,null,null,null,null,null,null,null,null,null,null,null,null,106,39.964484475564319,307.4191113504948,368.90293362059373,716.28652944665282]
[null,null,null,null,null,null,null,null,null,null,null,null,null,null,null,null,null,null,107,36.666666666666664,333.33333333333331,400,770]
[null,null,null,null,null,null,null,null,null,null,null,null,null,null,null,null,null,null,108,40.399735462515579,310.76719586550445,372.92063503860533,724.08756636662542]
[null,null,null,null,null,null,null,null,null,null,null,null,null,null,null,null,null,null,109,43.333333333333336,333.33333333333331,400,776.66666666666663]
[null,null,null,null,null,null,null,null,null,null,null,null,null,null,null,null,null,null,110,44.444444444444443,333.33333333333331,518.51851851851848,896.2962962962963]
[null,null,null,null,null,null,null,null,null,null,null,null,null,null,null,null,null,null,111,44.522397576532249,296.81598384354834,593.63196768709668,934.9703491071773]
[null,null,null,null,null,null,null,null,null,null,null,null,null,null,null,null,null,null,112,39.393939393939391,333.33333333333331,303.030303030303,675.75757575757575]
[null,null,null,null,null,null,null,null,null,null,null,null,null,null,null,null,null,null,113,51.878912595307142,296.45092911604081,592.90185823208162,941.23169994342959]
[null,null,null,null,null,null,null,null,null,null,null,null,null,null,null,null,null,null,114,50,333.33333333333331,666.66666666666663,1050]
[null,null,null,null,null,null,null,null,null,null,null,null,null,null,null,null,null,null,115,40.550100523174265,311.92385017826354,374.30862021391624,726.78257091535409]
[null,null,null,null,null,null,null,null,null,null,null,null,null,null,null,null,null,null,116,40.74074074074074,333.33333333333331,518.51851851851848,892.59259259259261]
[null,null,null,null,null,null,null,null,null,null,null,null,null,null,null,null,null,null,117,37.037037037037038,333.33333333333331,518.51851851851848,888.88888888888891]
[null,null,null,null,null,null,null,null,null,null,null,null,null,null,null,null,null,null,118,42.424242424242422,333.33333333333331,303.030303030303,678.78787878787875]
[null,null,null,null,null,null,null,null,null,null,null,null,null,null,null,null,null,null,119,40,333.33333333333331,400,773.33333333333337]
[null,null,null,null,null,null,null,null,null,null,null,null,null,null,null,null,null,null,120,40,333.33333333333331,400,773.33333333333337]
[null,null,null,null,null,null,null,null,null,null,null,null,null,null,null,null,null,null,121,44.444444444444443,333.33333333333331,518.51851851851848,896.2962962962963]
[null,null,null,null,null,null,null,null,null,null,null,null,null,null,null,null,null,null,122,48.768207078295873,313.50990264618775,487.68207078295876,849.96018050744237]
[null,null,null,null,null,null,null,null,null,null,null,null,null,null,null,null,null,null,123,45.833333333333336,333.33333333333331,666.66666666666663,1045.8333333333333]
[null,null,null,null,null,null,null,null,null,null,null,null,null,null,null,null,null,null,124,51.328082584143807,326.63325280818788,839.91407864962594,1217.8754140419576]
[null,null,null,null,null,null,null,null,null,null,null,null,null,null,null,null,null,null,125,40.74074074074074,333.33333333333331,518.51851851851848,892.59259259259261]
[null,null,null,null,null,null,null,null,null,null,null,null,null,null,null,null,null,null,126,52.38095238095238,333.33333333333331,857.14285714285711,1242.8571428571429]
[null,null,null,null,null,null,null,null,null,null,null,null,null,null,null,null,null,null,127,36.666666666666664,333.33333333333331,400,770]
[null,null,null,null,null,null,null,null,null,null,null,null,null,null,null,null,null,null,128,41.131203513101212,299.13602554982702,598.27205109965405,938.53928016258226]
[null,null,null,null,null,null,null,null,null,null,null,null,null,null,null,null,null,null,129,54.210254513117022,291.90137045524551,750.60352402777414,1096.7151489961366]
[null,null,null,null,null,null,null,null,null,null,null,null,null,null,null,null,null,null,130,36.111111111111114,333.33333333333331,222.22222222222223,591.66666666666663]
[null,null,null,null,null,null,null,null,null,null,null,null,null,null,null,null,null,null,{"$f":"+S141+1","v":131},46.666666666666664,333.33333333333331,400,780]
[null,null,null,null,null,null,null,null,null,null,null,null,null,null,null,null,null,null,132,48.148148148148145,333.33333333333331,518.51851851851848,900]
[null,null,null,null,null,null,null,null,null,null,null,null,null,null,null,null,null,null,133,40.74074074074074,333.33333333333331,518.51851851851848,892.59259259259261]
[null,null,null,null,null,null,null,null,null,null,null,null,null,null,null,null,null,null,134,42.557527355222099,319.18145516416575,496.50448581092445,858.24346833031234]
[null,null,null,null,null,null,null,null,null,null,null,null,null,null,null,null,null,null,135,42.300487588199033,296.10341311739319,761.40877658758257,1099.8126772931748]
[null,null,null,null,null,null,null,null,null,null,null,null,null,null,null,null,null,null,136,40,333.33333333333331,400,773.33333333333337]
[null,null,null,null,null,null,null,null,null,null,null,null,null,null,null,null,null,null,137,36.666666666666664,333.33333333333331,400,770]
[null,null,null,null,null,null,null,null,null,null,null,null,null,null,null,null,null,null,138,40.709652096321626,305.32239072241219,474.94594112375228,820.97798394248605]
[null,null,null,null,null,null,null,null,null,null,null,null,null,null,null,null,null,null,139,54.333328463154871,316.94441603507011,814.99992694732305,1186.2776714455481]
[null,null,null,null,null,null,null,null,null,null,null,null,null,null,null,null,null,null,140,36.666666666666664,333.33333333333331,400,770]
[null,null,null,null,null,null,null,null,null,null,null,null,null,null,null,null,null,null,141,50,333.33333333333331,666.66666666666663,1050]
[null,null,null,null,null,null,null,null,null,null,null,null,null,null,null,null,null,null,142,38.888888888888886,333.33333333333331,222.22222222222223,594.44444444444446]
[null,null,null,null,null,null,null,null,null,null,null,null,null,null,null,null,null,null,143,51.851851851851855,333.33333333333331,518.51851851851848,903.7037037037037]
[null,null,null,null,null,null,null,null,null,null,null,null,null,null,null,null,null,null,144,39.393939393939391,333.33333333333331,303.030303030303,675.75757575757575]
[null,null,null,null,null,null,null,null,null,null,null,null,null,null,null,null,null,null,145,43.333333333333336,333.33333333333331,400,776.66666666666663]
[null,null,null,null,null,null,null,null,null,null,null,null,null,null,null,null,null,null,146,40,333.33333333333331,400,773.33333333333337]
[null,null,null,null,null,null,null,null,null,null,null,null,null,null,null,null,null,null,147,47.640044536892965,306.25742916574052,476.4004453689297,830.29791907156311]
[null,null,null,null,null,null,null,null,null,null,null,null,null,null,null,null,null,null,148,36.666666666666664,333.33333333333331,400,770]
[null,null,null,null,null,null,null,null,null,null,null,null,null,null,null,null,null,null,149,39.527867247174491,323.40982293142764,503.08194678222077,866.01963696082294]

{"sheet":"Sheet2","index":1,"n_rows":0,"n_cols":0,"rows_kept":0,"cut":false,"hidden":false,"merged":[]}

{"sheet":"Sheet3","index":2,"n_rows":0,"n_cols":0,"rows_kept":0,"cut":false,"hidden":false,"merged":[]}